Reaction Details
Target5-hydroxytryptamine receptor 3A
LigandBDBM50400900
Substrate/Competitorn/a
Meas. Tech.ChEMBL_880265 (CHEMBL2215843)
Ki 17±n/a nM
Citation Bang-Andersen, BRuhland, TJørgensen, MSmith, GFrederiksen, KJensen, KGZhong, HNielsen, SMHogg, SMørk, AStensbøl, TB Discovery of 1-[2-(2,4-dimethylphenylsulfanyl)phenyl]piperazine (Lu AA21004): a novel multimodal compound for the treatment of major depressive disorder. J Med Chem54:3206-21 (2011) 
 
5-hydroxytryptamine receptor 3A
Name:5-hydroxytryptamine receptor 3A
Type:Protein
Mol. Mass.:55283.27
Organism:Homo sapiens (Human)
Description:P46098
Residue:478
BDBM50400900
NameBDBM50400900
Synonyms:CHEMBL2204362
TypeSmall organic molecule
Emp. Form.C18H22N2OS
Mol. Mass.314.445
SMILESCOc1cc(C)ccc1Sc1ccccc1N1CCNCC1