Reaction Details
TargetSodium-dependent serotonin transporter
LigandBDBM50400910
Substrate/Competitorn/a
Meas. Tech.ChEMBL_880263 (CHEMBL2215841)
IC50 25±n/a nM
Citation Bang-Andersen, BRuhland, TJørgensen, MSmith, GFrederiksen, KJensen, KGZhong, HNielsen, SMHogg, SMørk, AStensbøl, TB Discovery of 1-[2-(2,4-dimethylphenylsulfanyl)phenyl]piperazine (Lu AA21004): a novel multimodal compound for the treatment of major depressive disorder. J Med Chem54:3206-21 (2011) 
 
Sodium-dependent serotonin transporter
Name:Sodium-dependent serotonin transporter
Type:Multi-pass membrane protein
Mol. Mass.:70168.43
Organism:Rattus norvegicus (rat)
Description:P31652
Residue:630
BDBM50400910
NameBDBM50400910
Synonyms:CHEMBL2204365
TypeSmall organic molecule
Emp. Form.C19H24N2S
Mol. Mass.312.472
SMILESCc1ccc(Sc2ccc(C)cc2N2CCNCC2)c(C)c1