Reaction Details
TargetSodium-dependent serotonin transporter
LigandBDBM50400899
Substrate/Competitorn/a
Meas. Tech.ChEMBL_880263 (CHEMBL2215841)
IC50 9.7±n/a nM
Citation Bang-Andersen, BRuhland, TJørgensen, MSmith, GFrederiksen, KJensen, KGZhong, HNielsen, SMHogg, SMørk, AStensbøl, TB Discovery of 1-[2-(2,4-dimethylphenylsulfanyl)phenyl]piperazine (Lu AA21004): a novel multimodal compound for the treatment of major depressive disorder. J Med Chem54:3206-21 (2011) 
 
Sodium-dependent serotonin transporter
Name:Sodium-dependent serotonin transporter
Type:Multi-pass membrane protein
Mol. Mass.:70168.43
Organism:Rattus norvegicus (rat)
Description:P31652
Residue:630
BDBM50400899
NameBDBM50400899
Synonyms:CHEMBL2204363
TypeSmall organic molecule
Emp. Form.C17H19ClN2S
Mol. Mass.318.864
SMILESCc1ccc(Sc2ccccc2N2CCNCC2)c(Cl)c1