Reaction Details
TargetCytochrome P450 3A4
LigandBDBM50400889
Substrate/Competitorn/a
Meas. Tech.ChEMBL_880247 (CHEMBL2215825)
IC50 8700±n/a nM
Citation Bang-Andersen, BRuhland, TJørgensen, MSmith, GFrederiksen, KJensen, KGZhong, HNielsen, SMHogg, SMørk, AStensbøl, TB Discovery of 1-[2-(2,4-dimethylphenylsulfanyl)phenyl]piperazine (Lu AA21004): a novel multimodal compound for the treatment of major depressive disorder. J Med Chem54:3206-21 (2011) 
 
Cytochrome P450 3A4
Name:Cytochrome P450 3A4
Type:Enzyme
Mol. Mass.:57349.57
Organism:Homo sapiens (Human)
Description:n/a
Residue:503
BDBM50400889
NameBDBM50400889
Synonyms:CHEMBL2204357
TypeSmall organic molecule
Emp. Form.C18H22N2S
Mol. Mass.298.446
SMILESCc1cccc(Sc2ccccc2N2CCNCC2)c1C