Reaction Details
TargetCytochrome P450 2C9
LigandBDBM50400903
Substrate/Competitorn/a
Meas. Tech.ChEMBL_880249 (CHEMBL2215827)
IC50 34000±n/a nM
Citation Bang-Andersen, BRuhland, TJørgensen, MSmith, GFrederiksen, KJensen, KGZhong, HNielsen, SMHogg, SMørk, AStensbøl, TB Discovery of 1-[2-(2,4-dimethylphenylsulfanyl)phenyl]piperazine (Lu AA21004): a novel multimodal compound for the treatment of major depressive disorder. J Med Chem54:3206-21 (2011) 
 
Cytochrome P450 2C9
Name:Cytochrome P450 2C9
Type:Enzyme
Mol. Mass.:55636.33
Organism:Homo sapiens (Human)
Description:P11712
Residue:490
BDBM50400903
NameBDBM50400903
Synonyms:CHEMBL2204359
TypeSmall organic molecule
Emp. Form.C16H16Cl2N2S
Mol. Mass.339.283
SMILESClc1ccc(Sc2ccccc2N2CCNCC2)c(Cl)c1