Reaction Details
TargetC-X-C chemokine receptor type 3
LigandBDBM50400924
Substrate/Competitorn/a
Meas. Tech.ChEMBL_880272 (CHEMBL2215850)
Ki 1000±n/a nM
Citation Wijtmans, MVerzijl, DBergmans, SLai, MBosch, LSmit, MJde Esch, IJLeurs, R CXCR3 antagonists: quaternary ammonium salts equipped with biphenyl- and polycycloaliphatic-anchors. Bioorg Med Chem19:3384-93 (2011) 
 
C-X-C chemokine receptor type 3
Name:C-X-C chemokine receptor type 3
Type:Enzyme Catalytic Domain
Mol. Mass.:40665.65
Organism:Homo sapiens (Human)
Description:n/a
Residue:368
BDBM50400924
NameBDBM50400924
Synonyms:CHEMBL2205062
TypeSmall organic molecule
Emp. Form.C27H34NO2
Mol. Mass.404.5638
SMILESCOC(=O)c1cccc(c1)-c1ccc(C[N+](C)(C)CC2=CC[C@H]3C[C@@H]2C3(C)C)cc1