Reaction Details
TargetC-X-C chemokine receptor type 3
LigandBDBM50400928
Substrate/Competitorn/a
Meas. Tech.ChEMBL_880272 (CHEMBL2215850)
Ki 501.19±n/a nM
Citation Wijtmans, MVerzijl, DBergmans, SLai, MBosch, LSmit, MJde Esch, IJLeurs, R CXCR3 antagonists: quaternary ammonium salts equipped with biphenyl- and polycycloaliphatic-anchors. Bioorg Med Chem19:3384-93 (2011) 
 
C-X-C chemokine receptor type 3
Name:C-X-C chemokine receptor type 3
Type:Enzyme Catalytic Domain
Mol. Mass.:40665.65
Organism:Homo sapiens (Human)
Description:n/a
Residue:368
BDBM50400928
NameBDBM50400928
Synonyms:CHEMBL2205079
TypeSmall organic molecule
Emp. Form.C25H30NO
Mol. Mass.360.5113
SMILESCC1(C)[C@@H]2C[C@H]1C(C[N+](C)(C)Cc1ccc3oc4ccccc4c3c1)=CC2