Reaction Details
TargetC-X-C chemokine receptor type 3
LigandBDBM50400975
Substrate/Competitorn/a
Meas. Tech.ChEMBL_880272 (CHEMBL2215850)
Ki 794.33±n/a nM
Citation Wijtmans, MVerzijl, DBergmans, SLai, MBosch, LSmit, MJde Esch, IJLeurs, R CXCR3 antagonists: quaternary ammonium salts equipped with biphenyl- and polycycloaliphatic-anchors. Bioorg Med Chem19:3384-93 (2011) 
 
C-X-C chemokine receptor type 3
Name:C-X-C chemokine receptor type 3
Type:Enzyme Catalytic Domain
Mol. Mass.:40665.65
Organism:Homo sapiens (Human)
Description:n/a
Residue:368
BDBM50400975
NameBDBM50400975
Synonyms:CHEMBL2205723
TypeSmall organic molecule
Emp. Form.C20H29IN
Mol. Mass.410.3549
SMILESC[N+](C)(CC1C2CC3CC(C2)CC1C3)Cc1ccc(I)cc1