Reaction Details
TargetTranslocator protein
LigandBDBM50054139
Substrate/Competitorn/a
Meas. Tech.ChEMBL_879961 (CHEMBL2212410)
Ki 0.7±n/a nM
Citation Kumata, KYui, JHatori, AFujinaga, MYanamoto, KYamasaki, TKawamura, KWakizaka, HNengaki, NYoshida, YOgawa, MFukumura, TZhang, MR Synthesis and evaluation of novel carbon-11 labeled oxopurine analogues for positron emission tomography imaging of translocator protein (18 kDa) in peripheral organs. J Med Chem54:6040-9 (2011) 
 
Translocator protein
Name:Translocator protein
Type:Mitochondrion membrane protein
Mol. Mass.:18945.84
Organism:Rattus norvegicus (rat)
Description:Competitive binding experiments were performed on rat kidney mitochondrial membranes.
Residue:169
BDBM50054139
NameBDBM50054139
Synonyms:(R)1-(2-Chloro-phenyl)-isoquinoline-3-carboxylic acid sec-butyl-methyl-amide
TypeSmall organic molecule
Emp. Form.C21H21ClN2O
Mol. Mass.352.857
SMILESCC[C@@H](C)N(C)C(=O)c1cc2ccccc2c(n1)-c1ccccc1Cl