Reaction Details
TargetPotassium voltage-gated channel subfamily H member 2
LigandBDBM50401001
Substrate/Competitorn/a
Meas. Tech.ChEMBL_879386 (CHEMBL2208784)
IC50 300000±n/a nM
Citation Wager, TTPettersen, BASchmidt, AWSpracklin, DKMente, SButler, TWHoward, HLettiere, DJRubitski, DMWong, DFNedza, FMNelson, FRRollema, HRaggon, JWAubrecht, JFreeman, JKMarcek, JMCianfrogna, JCook, KWJames, LCChatman, LAIredale, PABanker, MJHomiski, MLMunzner, JBChandrasekaran, RY Discovery of two clinical histamine H(3) receptor antagonists: trans-N-ethyl-3-fluoro-3-[3-fluoro-4-(pyrrolidinylmethyl)phenyl]cyclobutanecarboxamide (PF-03654746) and trans-3-fluoro-3-[3-fluoro-4-(pyrrolidin-1-ylmethyl)phenyl]-N-(2-methylpropyl)cyclobutanecarboxamide (PF-03654764). J Med Chem54:7602-20 (2011) 
 
Potassium voltage-gated channel subfamily H member 2
Name:Potassium voltage-gated channel subfamily H member 2
Type:Multi-pass membrane protein
Mol. Mass.:126672.65
Organism:Homo sapiens (Human)
Description:Q12809
Residue:1159
BDBM50401001
NameBDBM50401001
Synonyms:CHEMBL2206288
TypeSmall organic molecule
Emp. Form.C20H30N2O
Mol. Mass.314.465
SMILESC([C@H]1C[C@H](C1)c1ccc(CN2CCCC2)cc1)N1CCOCC1