Reaction Details
TargetBeta-galactoside-binding lectin
LigandBDBM50401022
Substrate/Competitorn/a
Meas. Tech.ChEMBL_884641 (CHEMBL2214657)
IC50 460000±n/a nM
Citation André, SJarikote, DVYan, DVincenz, LWang, GNKaltner, HMurphy, PVGabius, HJ Synthesis of bivalent lactosides and their activity as sensors for differences between lectins in inter- and intrafamily comparisons. Bioorg Med Chem Lett22:313-8 (2011) 
 
Beta-galactoside-binding lectin
Name:Beta-galactoside-binding lectin
Type:PROTEIN
Mol. Mass.:15064.98
Organism:Gallus gallus
Description:ChEMBL_884641
Residue:135
BDBM50401022
NameBDBM50401022
Synonyms:CHEMBL2203662
TypeSmall organic molecule
Emp. Form.C84H106N8O30
Mol. Mass.1707.776
SMILESOC[C@H]1O[C@@H](O[C@@H]2[C@@H](CO)O[C@H]([C@H](O)[C@H]2O)n2cc(CO[C@H]3[C@H](OCc4ccccc4)[C@@H](OCc4ccccc4)[C@@H](CC=C)O[C@@H]3C(=O)NCc3ccc(CNC(=O)[C@@H]4O[C@@H](CC=C)[C@@H](OCc5ccccc5)[C@H](OCc5ccccc5)[C@H]4OCc4cn(nn4)[C@@H]4O[C@H](CO)[C@@H](O[C@@H]5O[C@H](CO)[C@H](O)[C@H](O)[C@H]5O)[C@H](O)[C@H]4O)cc3)nn2)[C@H](O)[C@@H](O)[C@H]1O