Reaction Details
TargetMuscarinic acetylcholine receptor M1
LigandBDBM50326219
Substrate/Competitorn/a
Meas. Tech.ChEMBL_882197 (CHEMBL2215470)
Ki 891.25±n/a nM
Citation Daval, SBValant, CBonnet, DKellenberger, EHibert, MGalzi, JLIlien, B Fluorescent derivatives of AC-42 to probe bitopic orthosteric/allosteric binding mechanisms on muscarinic M1 receptors. J Med Chem55:2125-43 (2012) 
 
Muscarinic acetylcholine receptor M1
Name:Muscarinic acetylcholine receptor M1
Type:Protein
Mol. Mass.:51442.54
Organism:Homo sapiens (Human)
Description:P11229
Residue:460
BDBM50326219
NameBDBM50326219
Synonyms:4-(4-butylpiperidin-1-yl)-1-o-tolylbutan-1-one CHEMBL2206334
TypeSmall organic molecule
Emp. Form.C20H31NO
Mol. Mass.301.4662
SMILESCCCCC1CCN(CCCC(=O)c2ccccc2C)CC1