Reaction Details
TargetCannabinoid receptor 2
LigandBDBM50401058
Substrate/Competitorn/a
Meas. Tech.ChEMBL_882431 (CHEMBL2210670)
Ki 2.1±n/a nM
Citation Wiley, JLSmith, VJChen, JMartin, BRHuffman, JW Synthesis and pharmacology of 1-alkyl-3-(1-naphthoyl)indoles: steric and electronic effects of 4- and 8-halogenated naphthoyl substituents. Bioorg Med Chem20:2067-81 (2012) 
 
Cannabinoid receptor 2
Name:Cannabinoid receptor 2
Type:G Protein-Coupled Receptor (GPCR)
Mol. Mass.:39690.94
Organism:Homo sapiens (Human)
Description:P34972
Residue:360
BDBM50401058
NameBDBM50401058
Synonyms:CHEMBL2206839
TypeSmall organic molecule
Emp. Form.C25H24INO
Mol. Mass.481.3686
SMILESCCCCCn1c(C)c(C(=O)c2ccc(I)c3ccccc23)c2ccccc12