Reaction Details
TargetCannabinoid receptor 2
LigandBDBM50401059
Substrate/Competitorn/a
Meas. Tech.ChEMBL_882431 (CHEMBL2210670)
Ki 1.3±n/a nM
Citation Wiley, JLSmith, VJChen, JMartin, BRHuffman, JW Synthesis and pharmacology of 1-alkyl-3-(1-naphthoyl)indoles: steric and electronic effects of 4- and 8-halogenated naphthoyl substituents. Bioorg Med Chem20:2067-81 (2012) 
 
Cannabinoid receptor 2
Name:Cannabinoid receptor 2
Type:G Protein-Coupled Receptor (GPCR)
Mol. Mass.:39690.94
Organism:Homo sapiens (Human)
Description:P34972
Residue:360
BDBM50401059
NameBDBM50401059
Synonyms:CHEMBL2206838
TypeSmall organic molecule
Emp. Form.C24H22INO
Mol. Mass.467.3421
SMILESCCCCCn1cc(C(=O)c2ccc(I)c3ccccc23)c2ccccc12