Reaction Details
TargetCannabinoid receptor 2
LigandBDBM50401060
Substrate/Competitorn/a
Meas. Tech.ChEMBL_882431 (CHEMBL2210670)
Ki 20±n/a nM
Citation Wiley, JLSmith, VJChen, JMartin, BRHuffman, JW Synthesis and pharmacology of 1-alkyl-3-(1-naphthoyl)indoles: steric and electronic effects of 4- and 8-halogenated naphthoyl substituents. Bioorg Med Chem20:2067-81 (2012) 
 
Cannabinoid receptor 2
Name:Cannabinoid receptor 2
Type:G Protein-Coupled Receptor (GPCR)
Mol. Mass.:39690.94
Organism:Homo sapiens (Human)
Description:P34972
Residue:360
BDBM50401060
NameBDBM50401060
Synonyms:CHEMBL2206837
TypeSmall organic molecule
Emp. Form.C23H20INO
Mol. Mass.453.3155
SMILESCCCn1c(C)c(C(=O)c2ccc(I)c3ccccc23)c2ccccc12