Reaction Details
TargetCannabinoid receptor 2
LigandBDBM50401072
Substrate/Competitorn/a
Meas. Tech.ChEMBL_882431 (CHEMBL2210670)
Ki 38±n/a nM
Citation Wiley, JLSmith, VJChen, JMartin, BRHuffman, JW Synthesis and pharmacology of 1-alkyl-3-(1-naphthoyl)indoles: steric and electronic effects of 4- and 8-halogenated naphthoyl substituents. Bioorg Med Chem20:2067-81 (2012) 
 
Cannabinoid receptor 2
Name:Cannabinoid receptor 2
Type:G Protein-Coupled Receptor (GPCR)
Mol. Mass.:39690.94
Organism:Homo sapiens (Human)
Description:P34972
Residue:360
BDBM50401072
NameBDBM50401072
Synonyms:CHEMBL2206854
TypeSmall organic molecule
Emp. Form.C23H20FNO
Mol. Mass.345.4094
SMILESCCCn1c(C)c(C(=O)c2ccc(F)c3ccccc23)c2ccccc12