Reaction Details
TargetCannabinoid receptor 1
LigandBDBM50401051
Substrate/Competitorn/a
Meas. Tech.ChEMBL_882430 (CHEMBL2210669)
Ki 21±n/a nM
Citation Wiley, JLSmith, VJChen, JMartin, BRHuffman, JW Synthesis and pharmacology of 1-alkyl-3-(1-naphthoyl)indoles: steric and electronic effects of 4- and 8-halogenated naphthoyl substituents. Bioorg Med Chem20:2067-81 (2012) 
 
Cannabinoid receptor 1
Name:Cannabinoid receptor 1
Type:G Protein-Coupled Receptor (GPCR)
Mol. Mass.:52868.96
Organism:Homo sapiens (Human)
Description:P21554
Residue:472
BDBM50401051
NameBDBM50401051
Synonyms:CHEMBL2206846
TypeSmall organic molecule
Emp. Form.C24H22BrNO
Mol. Mass.420.342
SMILESCCCCCn1cc(C(=O)c2cccc3cccc(Br)c23)c2ccccc12