Reaction Details
TargetCannabinoid receptor 1
LigandBDBM50401060
Substrate/Competitorn/a
Meas. Tech.ChEMBL_882430 (CHEMBL2210669)
Ki 501±n/a nM
Citation Wiley, JLSmith, VJChen, JMartin, BRHuffman, JW Synthesis and pharmacology of 1-alkyl-3-(1-naphthoyl)indoles: steric and electronic effects of 4- and 8-halogenated naphthoyl substituents. Bioorg Med Chem20:2067-81 (2012) 
 
Cannabinoid receptor 1
Name:Cannabinoid receptor 1
Type:G Protein-Coupled Receptor (GPCR)
Mol. Mass.:52868.96
Organism:Homo sapiens (Human)
Description:P21554
Residue:472
BDBM50401060
NameBDBM50401060
Synonyms:CHEMBL2206837
TypeSmall organic molecule
Emp. Form.C23H20INO
Mol. Mass.453.3155
SMILESCCCn1c(C)c(C(=O)c2ccc(I)c3ccccc23)c2ccccc12