Reaction Details
TargetCannabinoid receptor 1
LigandBDBM50401068
Substrate/Competitorn/a
Meas. Tech.ChEMBL_882430 (CHEMBL2210669)
Ki 187±n/a nM
Citation Wiley, JLSmith, VJChen, JMartin, BRHuffman, JW Synthesis and pharmacology of 1-alkyl-3-(1-naphthoyl)indoles: steric and electronic effects of 4- and 8-halogenated naphthoyl substituents. Bioorg Med Chem20:2067-81 (2012) 
 
Cannabinoid receptor 1
Name:Cannabinoid receptor 1
Type:G Protein-Coupled Receptor (GPCR)
Mol. Mass.:52868.96
Organism:Homo sapiens (Human)
Description:P21554
Residue:472
BDBM50401068
NameBDBM50401068
Synonyms:CHEMBL2206858
TypeSmall organic molecule
Emp. Form.C23H20ClNO
Mol. Mass.361.864
SMILESCCCn1c(C)c(C(=O)c2ccc(Cl)c3ccccc23)c2ccccc12