Reaction Details
TargetCannabinoid receptor 1
LigandBDBM50401069
Substrate/Competitorn/a
Meas. Tech.ChEMBL_882430 (CHEMBL2210669)
Ki 93±n/a nM
Citation Wiley, JLSmith, VJChen, JMartin, BRHuffman, JW Synthesis and pharmacology of 1-alkyl-3-(1-naphthoyl)indoles: steric and electronic effects of 4- and 8-halogenated naphthoyl substituents. Bioorg Med Chem20:2067-81 (2012) 
 
Cannabinoid receptor 1
Name:Cannabinoid receptor 1
Type:G Protein-Coupled Receptor (GPCR)
Mol. Mass.:52868.96
Organism:Homo sapiens (Human)
Description:P21554
Residue:472
BDBM50401069
NameBDBM50401069
Synonyms:CHEMBL2206857
TypeSmall organic molecule
Emp. Form.C22H18ClNO
Mol. Mass.347.837
SMILESCCCn1cc(C(=O)c2ccc(Cl)c3ccccc23)c2ccccc12