Reaction Details
TargetCannabinoid receptor 1
LigandBDBM50401072
Substrate/Competitorn/a
Meas. Tech.ChEMBL_882693 (CHEMBL2213572)
EC50 268000±n/a nM
Citation Wiley, JLSmith, VJChen, JMartin, BRHuffman, JW Synthesis and pharmacology of 1-alkyl-3-(1-naphthoyl)indoles: steric and electronic effects of 4- and 8-halogenated naphthoyl substituents. Bioorg Med Chem20:2067-81 (2012) 
 
Cannabinoid receptor 1
Name:Cannabinoid receptor 1
Type:G Protein-Coupled Receptor (GPCR)
Mol. Mass.:52868.96
Organism:Homo sapiens (Human)
Description:P21554
Residue:472
BDBM50401072
NameBDBM50401072
Synonyms:CHEMBL2206854
TypeSmall organic molecule
Emp. Form.C23H20FNO
Mol. Mass.345.4094
SMILESCCCn1c(C)c(C(=O)c2ccc(F)c3ccccc23)c2ccccc12