Reaction Details
TargetCholinesterase
LigandBDBM50401095
Substrate/Competitorn/a
Meas. Tech.ChEMBL_883946 (CHEMBL2214109)
IC50 50.12±n/a nM
Citation Chen, XZenger, KLupp, AKling, BHeilmann, JFleck, CKraus, BDecker, M Tacrine-silibinin codrug shows neuro- and hepatoprotective effects in vitro and pro-cognitive and hepatoprotective effects in vivo. J Med Chem55:5231-42 (2012) 
 
Cholinesterase
Name:Cholinesterase
Type:Enzyme
Mol. Mass.:65643.35
Organism:Equus caballus (Horse)
Description:P81908
Residue:574
BDBM50401095
NameBDBM50401095
Synonyms:CHEMBL2204447
TypeSmall organic molecule
Emp. Form.C48H51N3O12
Mol. Mass.861.9314
SMILESCOc1cc(ccc1O)[C@@H]1Oc2cc(ccc2O[C@H]1COC(=O)CCC(=O)NCCCCCCNc1c2CCCCc2nc2ccccc12)[C@H]1Oc2cc(O)cc(O)c2C(O)C1=O