Reaction Details
TargetProstaglandin D2 receptor 2
LigandBDBM50401108
Substrate/Competitorn/a
Meas. Tech.ChEMBL_884446 (CHEMBL2212208)
IC50 2±n/a nM
Citation Kaila, NHuang, AMoretto, AFollows, BJanz, KLowe, MThomason, JMansour, TSHubeau, CPage, KMorgan, PFish, SXu, XWilliams, CSaiah, E Diazine indole acetic acids as potent, selective, and orally bioavailable antagonists of chemoattractant receptor homologous molecule expressed on Th2 cells (CRTH2) for the treatment of allergic inflammatory diseases. J Med Chem55:5088-109 (2012) 
 
Prostaglandin D2 receptor 2
Name:Prostaglandin D2 receptor 2
Type:Enzyme
Mol. Mass.:43295.45
Organism:Homo sapiens (Human)
Description:Q9Y5Y4
Residue:395
BDBM50401108
NameBDBM50401108
Synonyms:CHEMBL2205148
TypeSmall organic molecule
Emp. Form.C27H21Cl2N3O4
Mol. Mass.522.379
SMILESCc1c(-c2nn(CCOc3ccc(Cl)cc3)c(=O)c3ccccc23)c2cc(Cl)ccc2n1CC(O)=O