Reaction Details
TargetProstaglandin D2 receptor 2
LigandBDBM50401119
Substrate/Competitorn/a
Meas. Tech.ChEMBL_884446 (CHEMBL2212208)
IC50 10±n/a nM
Citation Kaila, NHuang, AMoretto, AFollows, BJanz, KLowe, MThomason, JMansour, TSHubeau, CPage, KMorgan, PFish, SXu, XWilliams, CSaiah, E Diazine indole acetic acids as potent, selective, and orally bioavailable antagonists of chemoattractant receptor homologous molecule expressed on Th2 cells (CRTH2) for the treatment of allergic inflammatory diseases. J Med Chem55:5088-109 (2012) 
 
Prostaglandin D2 receptor 2
Name:Prostaglandin D2 receptor 2
Type:Enzyme
Mol. Mass.:43295.45
Organism:Homo sapiens (Human)
Description:Q9Y5Y4
Residue:395
BDBM50401119
NameBDBM50401119
Synonyms:CHEMBL2204471
TypeSmall organic molecule
Emp. Form.C22H16F3N3O3
Mol. Mass.427.3759
SMILESCc1c(-c2ccc(=O)n(Cc3ccc(F)cc3F)n2)c2cc(F)ccc2n1CC(O)=O