Reaction Details
TargetTyrosine-protein kinase Lyn
LigandBDBM50401152
Substrate/Competitorn/a
Meas. Tech.ChEMBL_881214 (CHEMBL2211519)
IC50<10000±n/a nM
Citation Sunose, MBell, KEllard, KBergamini, GNeubauer, GWerner, TRamsden, N Discovery of 5-(2-amino-[1,2,4]triazolo[1,5-a]pyridin-7-yl)-N-(tert-butyl)pyridine-3-sulfonamide (CZC24758), as a potent, orally bioavailable and selective inhibitor of PI3K for the treatment of inflammatory disease. Bioorg Med Chem Lett22:4613-8 (2012) 
 
Tyrosine-protein kinase Lyn
Name:Tyrosine-protein kinase Lyn
Type:Protein
Mol. Mass.:58575.92
Organism:Homo sapiens (Human)
Description:P07948
Residue:512
BDBM50401152
NameBDBM50401152
Synonyms:CHEMBL2205766
TypeSmall organic molecule
Emp. Form.C15H18N6O2S
Mol. Mass.346.407
SMILESCC(C)(C)NS(=O)(=O)c1cncc(c1)-c1ccn2nc(N)nc2c1