Reaction Details
TargetMitogen-activated protein kinase kinase kinase kinase 5
LigandBDBM50401152
Substrate/Competitorn/a
Meas. Tech.ChEMBL_881227 (CHEMBL2211532)
IC50<10000±n/a nM
Citation Sunose, MBell, KEllard, KBergamini, GNeubauer, GWerner, TRamsden, N Discovery of 5-(2-amino-[1,2,4]triazolo[1,5-a]pyridin-7-yl)-N-(tert-butyl)pyridine-3-sulfonamide (CZC24758), as a potent, orally bioavailable and selective inhibitor of PI3K for the treatment of inflammatory disease. Bioorg Med Chem Lett22:4613-8 (2012) 
 
Mitogen-activated protein kinase kinase kinase kinase 5
Name:Mitogen-activated protein kinase kinase kinase kinase 5
Type:PROTEIN
Mol. Mass.:95039.51
Organism:Homo sapiens (Human)
Description:ChEMBL_1495741
Residue:846
BDBM50401152
NameBDBM50401152
Synonyms:CHEMBL2205766
TypeSmall organic molecule
Emp. Form.C15H18N6O2S
Mol. Mass.346.407
SMILESCC(C)(C)NS(=O)(=O)c1cncc(c1)-c1ccn2nc(N)nc2c1