Reaction Details
TargetCytochrome P450 2D6
LigandBDBM50401154
Substrate/Competitorn/a
Meas. Tech.ChEMBL_881486 (CHEMBL2214473)
IC50 1300±n/a nM
Citation Gomaa, MSBridgens, CEIllingworth, NAVeal, GJRedfern, CPBrancale, AArmstrong, JLSimons, C Novel retinoic acid 4-hydroxylase (CYP26) inhibitors based on a 3-(1H-imidazol- and triazol-1-yl)-2,2-dimethyl-3-(4-(phenylamino)phenyl)propyl scaffold. Bioorg Med Chem20:4201-7 (2012) 
 
Cytochrome P450 2D6
Name:Cytochrome P450 2D6
Type:Protein
Mol. Mass.:55774.82
Organism:Homo sapiens (Human)
Description:P10635
Residue:497
BDBM50401154
NameBDBM50401154
Synonyms:CHEMBL2205775
TypeSmall organic molecule
Emp. Form.C20H22N4O2
Mol. Mass.350.4143
SMILESCOC(=O)C(C)(C)C(c1ccc(Nc2ccccc2)cc1)n1cncn1