Reaction Details
TargetCytochrome P450 26A1
LigandBDBM50401154
Substrate/Competitorn/a
Meas. Tech.ChEMBL_881496 (CHEMBL2214483)
IC50 13±n/a nM
Citation Gomaa, MSBridgens, CEIllingworth, NAVeal, GJRedfern, CPBrancale, AArmstrong, JLSimons, C Novel retinoic acid 4-hydroxylase (CYP26) inhibitors based on a 3-(1H-imidazol- and triazol-1-yl)-2,2-dimethyl-3-(4-(phenylamino)phenyl)propyl scaffold. Bioorg Med Chem20:4201-7 (2012) 
 
Cytochrome P450 26A1
Name:Cytochrome P450 26A1
Type:Enzyme
Mol. Mass.:56216.16
Organism:Homo sapiens (Human)
Description:O43174
Residue:497
BDBM50401154
NameBDBM50401154
Synonyms:CHEMBL2205775
TypeSmall organic molecule
Emp. Form.C20H22N4O2
Mol. Mass.350.4143
SMILESCOC(=O)C(C)(C)C(c1ccc(Nc2ccccc2)cc1)n1cncn1