Reaction Details
TargetSeed linoleate 13S-lipoxygenase-1
LigandBDBM50401193
Substrate/Competitorn/a
Meas. Tech.ChEMBL_881723 (CHEMBL2210181)
Ki 15700±n/a nM
Citation Wisastra, RGhizzoni, MBoltjes, AHaisma, HJDekker, FJ Anacardic acid derived salicylates are inhibitors or activators of lipoxygenases. Bioorg Med Chem20:5027-32 (2012) 
 
Seed linoleate 13S-lipoxygenase-1
Name:Seed linoleate 13S-lipoxygenase-1
Type:Enzyme
Mol. Mass.:94365.66
Organism:Glycine max (soybean)
Description:n/a
Residue:839
BDBM50401193
NameBDBM50401193
Synonyms:CHEMBL1934604
TypeSmall organic molecule
Emp. Form.C22H28O4
Mol. Mass.356.4553
SMILESCCCCCCCc1ccc(CCc2cc(O)cc(O)c2C(O)=O)cc1