Reaction Details
TargetTrace amine-associated receptor 1
LigandBDBM22532
Substrate/Competitorn/a
Meas. Tech.ChEMBL_882009 (CHEMBL2213071)
Ki 20±n/a nM
Citation Galley, GStalder, HGoergler, AHoener, MCNorcross, RD Optimisation of imidazole compounds as selective TAAR1 agonists: discovery of RO5073012. Bioorg Med Chem Lett22:5244-8 (2012) 
 
Trace amine-associated receptor 1
Name:Trace amine-associated receptor 1
Type:PROTEIN
Mol. Mass.:39107.47
Organism:Homo sapiens (Human)
Description:ChEMBL_792734
Residue:339
BDBM22532
NameBDBM22532
Synonyms:4-Benzyl-1H-imidazole derivative, 13 | 4-benzyl-1H-imidazole
TypeSmall organic molecule
Emp. Form.C10H10N2
Mol. Mass.158.1998
SMILESC(c1cnc[nH]1)c1ccccc1