Reaction Details
TargetCholinesterase
LigandBDBM50401238
Substrate/Competitorn/a
Meas. Tech.ChEMBL_882270 (CHEMBL2216410)
IC50>10000±n/a nM
Citation Maalej, EChabchoub, FOset-Gasque, MJEsquivias-Pérez, MGonzález, MPMonjas, LPérez, Cde los Ríos, CRodríguez-Franco, MIIriepa, IMoraleda, IChioua, MRomero, AMarco-Contelles, JSamadi, A Synthesis, biological assessment, and molecular modeling of racemic 7-aryl-9,10,11,12-tetrahydro-7H-benzo[7,8]chromeno[2,3-b]quinolin-8-amines as potential drugs for the treatment of Alzheimer's disease. Eur J Med Chem54:750-63 (2012) 
 
Cholinesterase
Name:Cholinesterase
Type:Homotetramer
Mol. Mass.:68422.27
Organism:Homo sapiens (Human)
Description:P06276
Residue:602
BDBM50401238
NameBDBM50401238
Synonyms:CHEMBL2206895
TypeSmall organic molecule
Emp. Form.C27H24N2O3
Mol. Mass.424.4911
SMILESCOc1cc(ccc1O)C1c2ccc3ccccc3c2Oc2nc3CCCCc3c(N)c12