Reaction Details
TargetPhosphatidylinositol 4,5-bisphosphate 3-kinase catalytic subunit gamma isoform
LigandBDBM50401256
Substrate/Competitorn/a
Meas. Tech.ChEMBL_882541 (CHEMBL2211631)
Ki 2.2±n/a nM
Citation Wurz, RPLiu, LYang, KNishimura, NBo, YPettus, LHCaenepeel, SFreeman, DJMcCarter, JDMullady, ELMiguel, TSWang, LZhang, NAndrews, KLWhittington, DAJiang, JSubramanian, RHughes, PENorman, MH Synthesis and structure-activity relationships of dual PI3K/mTOR inhibitors based on a 4-amino-6-methyl-1,3,5-triazine sulfonamide scaffold. Bioorg Med Chem Lett22:5714-20 (2012) 
 
Phosphatidylinositol 4,5-bisphosphate 3-kinase catalytic subunit gamma isoform
Name:Phosphatidylinositol 4,5-bisphosphate 3-kinase catalytic subunit gamma isoform
Type:Enzyme Subunit
Mol. Mass.:126470.30
Organism:Homo sapiens (Human)
Description:P48736
Residue:1102
BDBM50401256
NameBDBM50401256
Synonyms:CHEMBL2206904 | US8772480, 331
TypeSmall organic molecule
Emp. Form.C17H20ClN9O3S
Mol. Mass.465.917
SMILESCOc1cnc(Nc2cnc(Cl)c(NS(=O)(=O)N(C)C)c2)c(c1)-c1nc(C)nc(N)n1