Reaction Details
TargetNitric oxide synthase, brain
LigandBDBM50401279
Substrate/Competitorn/a
Meas. Tech.ChEMBL_882960 (CHEMBL2209794)
IC50 120±n/a nM
Citation Annedi, SCMaddaford, SPRamnauth, JRenton, PRybak, TSilverman, SRakhit, SMladenova, GDove, PAndrews, JSZhang, DPorreca, F Discovery of a potent, orally bioavailable and highly selective human neuronal nitric oxide synthase (nNOS) inhibitor, N-(1-(piperidin-4-yl)indolin-5-yl)thiophene-2-carboximidamide as a pre-clinical development candidate for the treatment of migraine. Eur J Med Chem55:94-107 (2012) 
 
Nitric oxide synthase, brain
Name:Nitric oxide synthase, brain
Type:Homodimer
Mol. Mass.:160985.98
Organism:Homo sapiens (Human)
Description:P29475
Residue:1434
BDBM50401279
NameBDBM50401279
Synonyms:CHEMBL3215893
TypeSmall organic molecule
Emp. Form.C19H26Cl2N4S
Mol. Mass.413.408
SMILESCl.Cl.N=C(Nc1ccc2N(CCN3CCCC3)CCc2c1)c1cccs1