Reaction Details
TargetDual specificity mitogen-activated protein kinase kinase 1
LigandBDBM50401285
Substrate/Competitorn/a
Meas. Tech.ChEMBL_883061 (CHEMBL2210705)
IC50 1000±n/a nM
Citation Hirose, MOkaniwa, MMiyazaki, TImada, TOhashi, TTanaka, YArita, TYabuki, MKawamoto, TTsutsumi, SSumita, ATakagi, TSang, BCYano, JAertgeerts, KYoshida, SIshikawa, T Design and synthesis of novel DFG-out RAF/vascular endothelial growth factor receptor 2 (VEGFR2) inhibitors: 3. Evaluation of 5-amino-linked thiazolo[5,4-d]pyrimidine and thiazolo[5,4-b]pyridine derivatives. Bioorg Med Chem20:5600-15 (2012) 
 
Dual specificity mitogen-activated protein kinase kinase 1
Name:Dual specificity mitogen-activated protein kinase kinase 1
Type:Other Protein Type
Mol. Mass.:43439.03
Organism:Homo sapiens (Human)
Description:Full-length human MEK-1 was generated by PCR and purified as a fusion protein from Escherichia coli lysates.
Residue:393
BDBM50401285
NameBDBM50401285
Synonyms:CHEMBL2204532
TypeSmall organic molecule
Emp. Form.C28H24ClFN6O3S
Mol. Mass.579.045
SMILESCN(c1ccc(F)c(NC(=O)c2cccc(OC(C)(C)C#N)c2Cl)c1)c1ccc2nc(NC(=O)C3CC3)sc2n1