Reaction Details
TargetProto-oncogene tyrosine-protein kinase Src
LigandBDBM50401285
Substrate/Competitorn/a
Meas. Tech.ChEMBL_883074 (CHEMBL2210718)
IC50 130±n/a nM
Citation Hirose, MOkaniwa, MMiyazaki, TImada, TOhashi, TTanaka, YArita, TYabuki, MKawamoto, TTsutsumi, SSumita, ATakagi, TSang, BCYano, JAertgeerts, KYoshida, SIshikawa, T Design and synthesis of novel DFG-out RAF/vascular endothelial growth factor receptor 2 (VEGFR2) inhibitors: 3. Evaluation of 5-amino-linked thiazolo[5,4-d]pyrimidine and thiazolo[5,4-b]pyridine derivatives. Bioorg Med Chem20:5600-15 (2012) 
 
Proto-oncogene tyrosine-protein kinase Src
Name:Proto-oncogene tyrosine-protein kinase Src
Type:Protein
Mol. Mass.:59838.60
Organism:Homo sapiens (Human)
Description:P12931
Residue:536
BDBM50401285
NameBDBM50401285
Synonyms:CHEMBL2204532
TypeSmall organic molecule
Emp. Form.C28H24ClFN6O3S
Mol. Mass.579.045
SMILESCN(c1ccc(F)c(NC(=O)c2cccc(OC(C)(C)C#N)c2Cl)c1)c1ccc2nc(NC(=O)C3CC3)sc2n1