Reaction Details
TargetVascular endothelial growth factor receptor 2
LigandBDBM50401288
Substrate/Competitorn/a
Meas. Tech.ChEMBL_883085 (CHEMBL2210729)
IC50 10±n/a nM
Citation Hirose, MOkaniwa, MMiyazaki, TImada, TOhashi, TTanaka, YArita, TYabuki, MKawamoto, TTsutsumi, SSumita, ATakagi, TSang, BCYano, JAertgeerts, KYoshida, SIshikawa, T Design and synthesis of novel DFG-out RAF/vascular endothelial growth factor receptor 2 (VEGFR2) inhibitors: 3. Evaluation of 5-amino-linked thiazolo[5,4-d]pyrimidine and thiazolo[5,4-b]pyridine derivatives. Bioorg Med Chem20:5600-15 (2012) 
 
Vascular endothelial growth factor receptor 2
Name:Vascular endothelial growth factor receptor 2
Type:Receptor Tyrosine Kinase
Mol. Mass.:151510.97
Organism:Homo sapiens (Human)
Description:P35968
Residue:1356
BDBM50401288
NameBDBM50401288
Synonyms:CHEMBL2204530
TypeSmall organic molecule
Emp. Form.C26H23FN6O3S
Mol. Mass.518.563
SMILESCN(c1ccc(F)c(NC(=O)c2cccc(OC(C)(C)C#N)c2)c1)c1ccc2nc(NC(C)=O)sc2n1