Reaction Details
TargetVascular endothelial growth factor receptor 2
LigandBDBM50401290
Substrate/Competitorn/a
Meas. Tech.ChEMBL_883085 (CHEMBL2210729)
IC50 510±n/a nM
Citation Hirose, MOkaniwa, MMiyazaki, TImada, TOhashi, TTanaka, YArita, TYabuki, MKawamoto, TTsutsumi, SSumita, ATakagi, TSang, BCYano, JAertgeerts, KYoshida, SIshikawa, T Design and synthesis of novel DFG-out RAF/vascular endothelial growth factor receptor 2 (VEGFR2) inhibitors: 3. Evaluation of 5-amino-linked thiazolo[5,4-d]pyrimidine and thiazolo[5,4-b]pyridine derivatives. Bioorg Med Chem20:5600-15 (2012) 
 
Vascular endothelial growth factor receptor 2
Name:Vascular endothelial growth factor receptor 2
Type:Receptor Tyrosine Kinase
Mol. Mass.:151510.97
Organism:Homo sapiens (Human)
Description:P35968
Residue:1356
BDBM50401290
NameBDBM50401290
Synonyms:CHEMBL2204528
TypeSmall organic molecule
Emp. Form.C25H23N7O3S
Mol. Mass.501.56
SMILESCC(=O)Nc1nc2cnc(Nc3cc(NC(=O)c4cccc(OC(C)(C)C#N)c4)ccc3C)nc2s1