Reaction Details
TargetSonic hedgehog protein
LigandBDBM50401325
Substrate/Competitorn/a
Meas. Tech.ChEMBL_883326 (CHEMBL2213635)
IC50 4.9±n/a nM
Citation Ohashi, TOguro, YTanaka, TShiokawa, ZTanaka, YShibata, SSato, YYamakawa, HHattori, HYamamoto, YKondo, SMiyamoto, MNishihara, MIshimura, YTojo, HBaba, ASasaki, S Discovery of the investigational drug TAK-441, a pyrrolo[3,2-c]pyridine derivative, as a highly potent and orally active hedgehog signaling inhibitor: modification of the core skeleton for improved solubility. Bioorg Med Chem20:5507-17 (2012) 
 
Sonic hedgehog protein
Name:Sonic hedgehog protein
Type:Protein
Mol. Mass.:47784.50
Organism:Mus musculus (Mouse)
Description:Q62226
Residue:437
BDBM50401325
NameBDBM50401325
Synonyms:CHEMBL2205228
TypeSmall organic molecule
Emp. Form.C28H33FN4O6
Mol. Mass.540.5832
SMILESCCc1cc2n(C)c(C(=O)NC3CCN(CC3)C(=O)CO)c(OCCF)c2c(=O)n1CC(=O)c1ccccc1