Reaction Details
TargetSonic hedgehog protein
LigandBDBM50401328
Substrate/Competitorn/a
Meas. Tech.ChEMBL_883326 (CHEMBL2213635)
IC50 4.6±n/a nM
Citation Ohashi, TOguro, YTanaka, TShiokawa, ZTanaka, YShibata, SSato, YYamakawa, HHattori, HYamamoto, YKondo, SMiyamoto, MNishihara, MIshimura, YTojo, HBaba, ASasaki, S Discovery of the investigational drug TAK-441, a pyrrolo[3,2-c]pyridine derivative, as a highly potent and orally active hedgehog signaling inhibitor: modification of the core skeleton for improved solubility. Bioorg Med Chem20:5507-17 (2012) 
 
Sonic hedgehog protein
Name:Sonic hedgehog protein
Type:Protein
Mol. Mass.:47784.50
Organism:Mus musculus (Mouse)
Description:Q62226
Residue:437
BDBM50401328
NameBDBM50401328
Synonyms:CHEMBL2087239
TypeSmall organic molecule
Emp. Form.C29H30N4O6
Mol. Mass.530.5717
SMILESCOc1c(C(=O)NC2CCN(CC2)C(=O)CO)n(C)c2c1c(=O)n(CC(=O)c1ccccc1)c1ccccc21