Reaction Details
TargetHeat shock protein HSP 90-alpha
LigandBDBM20800
Substrate/Competitorn/a
Meas. Tech.ChEMBL_883818 (CHEMBL2212644)
Ki 1.7±n/a nM
Citation Shi, JVan de Water, RHong, KLamer, RBWeichert, KWSandoval, CMKasibhatla, SRBoehm, MFChao, JLundgren, KTimple, NLough, RIbanez, GBoykin, CBurrows, FJKehry, MRYun, TJHarning, EKAmbrose, CThompson, JBixler, SADunah, ASnodgrass-Belt, PArndt, JEnyedy, IJLi, PHong, VSMcKenzie, ABiamonte, MA EC144 is a potent inhibitor of the heat shock protein 90. J Med Chem55:7786-95 (2012) 
 
Heat shock protein HSP 90-alpha
Name:Heat shock protein HSP 90-alpha
Type:Molecular Chaperone
Mol. Mass.:84623.45
Organism:Homo sapiens (Human)
Description:P07900
Residue:732
BDBM20800
NameBDBM20800
Synonyms:2-amino-6-halopurine analogue, 20 CHEMBL467399 | hsp90_107
TypeSmall organic molecule
Emp. Form.C14H15ClN6O
Mol. Mass.318.762
SMILESCOc1c(C)cnc(Cn2cnc3c(Cl)nc(N)nc23)c1C