Reaction Details
TargetC-C chemokine receptor type 1
LigandBDBM50401348
Substrate/Competitorn/a
Meas. Tech.ChEMBL_884032 (CHEMBL2215081)
IC50 112000±n/a nM
Citation Thiele, SMalmgaard-Clausen, MEngel-Andreasen, JSteen, ARummel, PCNielsen, MCGloriam, DEFrimurer, TMUlven, TRosenkilde, MM Modulation in selectivity and allosteric properties of small-molecule ligands for CC-chemokine receptors. J Med Chem55:8164-77 (2012) 
 
C-C chemokine receptor type 1
Name:C-C chemokine receptor type 1
Type:Enzyme
Mol. Mass.:41180.69
Organism:Homo sapiens (Human)
Description:P32246
Residue:355
BDBM50401348
NameBDBM50401348
Synonyms:CHEMBL593442
TypeSmall organic molecule
Emp. Form.C14H12N2
Mol. Mass.208.2585
SMILESCc1ccnc2c1ccc1c(C)ccnc21