Reaction Details
TargetC-C chemokine receptor type 1
LigandBDBM50092158
Substrate/Competitorn/a
Meas. Tech.ChEMBL_884039 (CHEMBL2215088)
EC50 6309.57±n/a nM
Citation Thiele, SMalmgaard-Clausen, MEngel-Andreasen, JSteen, ARummel, PCNielsen, MCGloriam, DEFrimurer, TMUlven, TRosenkilde, MM Modulation in selectivity and allosteric properties of small-molecule ligands for CC-chemokine receptors. J Med Chem55:8164-77 (2012) 
 
C-C chemokine receptor type 1
Name:C-C chemokine receptor type 1
Type:Enzyme
Mol. Mass.:41180.69
Organism:Homo sapiens (Human)
Description:P32246
Residue:355
BDBM50092158
NameBDBM50092158
Synonyms:1,10-phenanthroline US10669227, Compound 1,10-phenanthroline US9187406, 1,10-phenanthroline | cid_1318
TypeSmall organic molecule
Emp. Form.C12H8N2
Mol. Mass.180.2053
SMILESc1cnc2c(c1)ccc1cccnc21