Reaction Details
TargetC-C chemokine receptor type 8
LigandBDBM50401352
Substrate/Competitorn/a
Meas. Tech.ChEMBL_884037 (CHEMBL2215086)
EC50 670±n/a nM
Citation Thiele, SMalmgaard-Clausen, MEngel-Andreasen, JSteen, ARummel, PCNielsen, MCGloriam, DEFrimurer, TMUlven, TRosenkilde, MM Modulation in selectivity and allosteric properties of small-molecule ligands for CC-chemokine receptors. J Med Chem55:8164-77 (2012) 
 
C-C chemokine receptor type 8
Name:C-C chemokine receptor type 8
Type:PROTEIN
Mol. Mass.:40855.53
Organism:Homo sapiens (Human)
Description:ChEMBL_454278
Residue:355
BDBM50401352
NameBDBM50401352
Synonyms:CHEMBL2205810
TypeSmall organic molecule
Emp. Form.C13H10N2
Mol. Mass.194.2319
SMILESCc1cnc2c(ccc3cccnc23)c1