Reaction Details
TargetC-C chemokine receptor type 8
LigandBDBM50042874
Substrate/Competitorn/a
Meas. Tech.ChEMBL_884037 (CHEMBL2215086)
EC50 42000±n/a nM
Citation Thiele, SMalmgaard-Clausen, MEngel-Andreasen, JSteen, ARummel, PCNielsen, MCGloriam, DEFrimurer, TMUlven, TRosenkilde, MM Modulation in selectivity and allosteric properties of small-molecule ligands for CC-chemokine receptors. J Med Chem55:8164-77 (2012) 
 
C-C chemokine receptor type 8
Name:C-C chemokine receptor type 8
Type:PROTEIN
Mol. Mass.:40855.53
Organism:Homo sapiens (Human)
Description:ChEMBL_454278
Residue:355
BDBM50042874
NameBDBM50042874
Synonyms:2,2'-Bipyridin 2,2'-bipyridyl 2,2'-dipyridyl CHEMBL39879 alpha,alpha'-bipyridine alpha,alpha'-dipyridine bpy
TypeSmall organic molecule
Emp. Form.C10H8N2
Mol. Mass.156.1839
SMILESc1ccc(nc1)-c1ccccn1