Reaction Details
TargetC-C chemokine receptor type 5
LigandBDBM50401354
Substrate/Competitorn/a
Meas. Tech.ChEMBL_884030 (CHEMBL2215079)
IC50 8100±n/a nM
Citation Thiele, SMalmgaard-Clausen, MEngel-Andreasen, JSteen, ARummel, PCNielsen, MCGloriam, DEFrimurer, TMUlven, TRosenkilde, MM Modulation in selectivity and allosteric properties of small-molecule ligands for CC-chemokine receptors. J Med Chem55:8164-77 (2012) 
 
C-C chemokine receptor type 5
Name:C-C chemokine receptor type 5
Type:Enzyme
Mol. Mass.:40540.21
Organism:Homo sapiens (Human)
Description:P51681
Residue:352
BDBM50401354
NameBDBM50401354
Synonyms:CHEMBL2205805
TypeSmall organic molecule
Emp. Form.C15H10ClN3
Mol. Mass.267.713
SMILESClc1cc(nc(c1)-c1ccccn1)-c1ccccn1