Reaction Details
TargetC-C chemokine receptor type 5
LigandBDBM50401341
Substrate/Competitorn/a
Meas. Tech.ChEMBL_884030 (CHEMBL2215079)
IC50 128000±n/a nM
Citation Thiele, SMalmgaard-Clausen, MEngel-Andreasen, JSteen, ARummel, PCNielsen, MCGloriam, DEFrimurer, TMUlven, TRosenkilde, MM Modulation in selectivity and allosteric properties of small-molecule ligands for CC-chemokine receptors. J Med Chem55:8164-77 (2012) 
 
C-C chemokine receptor type 5
Name:C-C chemokine receptor type 5
Type:Enzyme
Mol. Mass.:40540.21
Organism:Homo sapiens (Human)
Description:P51681
Residue:352
BDBM50401341
NameBDBM50401341
Synonyms:CHEMBL2205803
TypeSmall organic molecule
Emp. Form.C14H8N2O2
Mol. Mass.236.2255
SMILESO=Cc1ccc2ccc3ccc(C=O)nc3c2n1