Reaction Details
TargetC-C chemokine receptor type 5
LigandBDBM50401342
Substrate/Competitorn/a
Meas. Tech.ChEMBL_884030 (CHEMBL2215079)
IC50 587000±n/a nM
Citation Thiele, SMalmgaard-Clausen, MEngel-Andreasen, JSteen, ARummel, PCNielsen, MCGloriam, DEFrimurer, TMUlven, TRosenkilde, MM Modulation in selectivity and allosteric properties of small-molecule ligands for CC-chemokine receptors. J Med Chem55:8164-77 (2012) 
 
C-C chemokine receptor type 5
Name:C-C chemokine receptor type 5
Type:Enzyme
Mol. Mass.:40540.21
Organism:Homo sapiens (Human)
Description:P51681
Residue:352
BDBM50401342
NameBDBM50401342
Synonyms:CHEMBL2205802
TypeSmall organic molecule
Emp. Form.C14H12N2O2
Mol. Mass.240.2573
SMILESOCc1ccc2ccc3ccc(CO)nc3c2n1