Reaction Details
TargetC-C chemokine receptor type 5
LigandBDBM38924
Substrate/Competitorn/a
Meas. Tech.ChEMBL_884038 (CHEMBL2215087)
EC50 29000±n/a nM
Citation Thiele, SMalmgaard-Clausen, MEngel-Andreasen, JSteen, ARummel, PCNielsen, MCGloriam, DEFrimurer, TMUlven, TRosenkilde, MM Modulation in selectivity and allosteric properties of small-molecule ligands for CC-chemokine receptors. J Med Chem55:8164-77 (2012) 
 
C-C chemokine receptor type 5
Name:C-C chemokine receptor type 5
Type:Enzyme
Mol. Mass.:40540.21
Organism:Homo sapiens (Human)
Description:P51681
Residue:352
BDBM38924
NameBDBM38924
Synonyms:2,6-bis(2-pyridinyl)pyridine 2,6-dipyridin-2-ylpyridine SMR000060049 | cid_70848
TypeSmall organic molecule
Emp. Form.C15H11N3
Mol. Mass.233.2679
SMILESc1ccc(nc1)-c1cccc(n1)-c1ccccn1