Reaction Details
TargetC-C chemokine receptor type 1
LigandBDBM50401353
Substrate/Competitorn/a
Meas. Tech.ChEMBL_884039 (CHEMBL2215088)
EC50 4900±n/a nM
Citation Thiele, SMalmgaard-Clausen, MEngel-Andreasen, JSteen, ARummel, PCNielsen, MCGloriam, DEFrimurer, TMUlven, TRosenkilde, MM Modulation in selectivity and allosteric properties of small-molecule ligands for CC-chemokine receptors. J Med Chem55:8164-77 (2012) 
 
C-C chemokine receptor type 1
Name:C-C chemokine receptor type 1
Type:Enzyme
Mol. Mass.:41180.69
Organism:Homo sapiens (Human)
Description:P32246
Residue:355
BDBM50401353
NameBDBM50401353
Synonyms:CHEMBL2205809
TypeSmall organic molecule
Emp. Form.C14H12N2
Mol. Mass.208.2585
SMILESCc1cnc2c(ccc3cc(C)cnc23)c1