Reaction Details
TargetC-C chemokine receptor type 8
LigandBDBM50401354
Substrate/Competitorn/a
Meas. Tech.ChEMBL_884037 (CHEMBL2215086)
EC50 398.11±n/a nM
Citation Thiele, SMalmgaard-Clausen, MEngel-Andreasen, JSteen, ARummel, PCNielsen, MCGloriam, DEFrimurer, TMUlven, TRosenkilde, MM Modulation in selectivity and allosteric properties of small-molecule ligands for CC-chemokine receptors. J Med Chem55:8164-77 (2012) 
 
C-C chemokine receptor type 8
Name:C-C chemokine receptor type 8
Type:PROTEIN
Mol. Mass.:40855.53
Organism:Homo sapiens (Human)
Description:ChEMBL_454278
Residue:355
BDBM50401354
NameBDBM50401354
Synonyms:CHEMBL2205805
TypeSmall organic molecule
Emp. Form.C15H10ClN3
Mol. Mass.267.713
SMILESClc1cc(nc(c1)-c1ccccn1)-c1ccccn1